BDBM50152507 CHEMBL182555::[1-(4-Butoxy-benzoyl)-2-methyl-1H-indol-4-yl]-acetic acid
SMILES CCCCOc1ccc(cc1)C(=O)n1c(C)cc2c(CC(O)=O)cccc12
InChI Key InChIKey=HSIPEEIFZHZSBZ-UHFFFAOYSA-N
Data  5 KI  1 IC50
  Tab Delimited (TSV)   2D SDfile   Computed 3D by Vconf -m prep SDfile
Find this compound or compounds like it in BindingDB:
Activity Spreadsheet -- Enzyme Inhibition Constant Data from BindingDB
Found 6 hits for monomerid = 50152507
TargetProstaglandin D2 receptor(Mus musculus)
Minase Research Institute
Curated by ChEMBL
LigandPNGBDBM50152507(CHEMBL182555 | [1-(4-Butoxy-benzoyl)-2-methyl-1H-i...)
Affinity DataKi:  10nM. Assay description: Ability to inhibit the binding of [3H]-PGD-2 radioligand to membranes of CHO cells stably expressing mouse Prostaglandin D2 receptor
In DepthDetails ArticlePubMed
TargetProstaglandin E2 receptor EP2 subtype(Mus musculus (Mouse))
Minase Research Institute
Curated by ChEMBL
LigandPNGBDBM50152507(CHEMBL182555 | [1-(4-Butoxy-benzoyl)-2-methyl-1H-i...)
Affinity DataKi:  2.00E+3nM. Assay description: Ability to inhibit the binding of [3H]-PGD-2 radioligand to membranes of CHO cells stably expressing mouse Prostaglandin E receptor EP2
In DepthDetails ArticlePubMed
TargetProstaglandin E2 receptor EP3 subtype(Mus musculus (Mouse))
Minase Research Institute
Curated by ChEMBL
LigandPNGBDBM50152507(CHEMBL182555 | [1-(4-Butoxy-benzoyl)-2-methyl-1H-i...)
Affinity DataKi:  3.30E+3nM. Assay description: Ability to inhibit the binding of [3H]-PGD-2 radioligand to membranes of CHO cells stably expressing mouse Prostaglandin E receptor EP3
In DepthDetails ArticlePubMed
TargetProstaglandin E2 receptor EP4 subtype(Mus musculus (Mouse))
Minase Research Institute
Curated by ChEMBL
LigandPNGBDBM50152507(CHEMBL182555 | [1-(4-Butoxy-benzoyl)-2-methyl-1H-i...)
Affinity DataKi: >1.00E+4nM. Assay description: Ability to inhibit the binding of [3H]-PGD-2 radioligand to membranes of CHO cells stably expressing mouse Prostaglandin E receptor EP4
In DepthDetails ArticlePubMed
TargetProstaglandin E2 receptor EP1 subtype(Mus musculus (Mouse))
Minase Research Institute
Curated by ChEMBL
LigandPNGBDBM50152507(CHEMBL182555 | [1-(4-Butoxy-benzoyl)-2-methyl-1H-i...)
Affinity DataKi: >1.00E+4nM. Assay description: Ability to inhibit the binding of [3H]-PGD-2 radioligand to membranes of CHO cells stably expressing mouse Prostaglandin E receptor EP1
In DepthDetails ArticlePubMed
TargetProstaglandin D2 receptor(Mus musculus)
Minase Research Institute
Curated by ChEMBL
LigandPNGBDBM50152507(CHEMBL182555 | [1-(4-Butoxy-benzoyl)-2-methyl-1H-i...)
Affinity DataIC50:  300nM. Assay description: Effect on the increase in cAMP formation induced by PGD-2 in the presence of bovine serum albumin in CHO cells expressing mouse Prostaglandin D2 rece...
In DepthDetails ArticlePubMed