BDBM50152514 CHEMBL365829::{1-[4-(Chroman-2-ylmethoxy)-benzoyl]-2-methyl-1H-indol-4-yl}-acetic acid
SMILES Cc1cc2c(CC(O)=O)cccc2n1C(=O)c1ccc(OCC2CCc3ccccc3O2)cc1
InChI Key InChIKey=GWYIZWZVKYKMGF-UHFFFAOYSA-N
Data  6 KI  1 IC50
  Tab Delimited (TSV)   2D SDfile   Computed 3D by Vconf -m prep SDfile
Find this compound or compounds like it in BindingDB:
Activity Spreadsheet -- Enzyme Inhibition Constant Data from BindingDB
Found 7 hits for monomerid = 50152514
TargetProstaglandin D2 receptor(Homo sapiens (Human))
Minase Research Institute
Curated by ChEMBL
LigandPNGBDBM50152514(CHEMBL365829 | {1-[4-(Chroman-2-ylmethoxy)-benzoyl...)
Affinity DataKi:  50nM. Assay description: Ability to inhibit the binding of [3H]-PGD-2 radioligand to membranes of CHO cells stably expressing human Prostaglandin D2 receptor
In DepthDetails ArticlePubMed
TargetProstaglandin D2 receptor(Mus musculus)
Minase Research Institute
Curated by ChEMBL
LigandPNGBDBM50152514(CHEMBL365829 | {1-[4-(Chroman-2-ylmethoxy)-benzoyl...)
Affinity DataKi:  60nM. Assay description: Ability to inhibit the binding of [3H]-PGD-2 radioligand to membranes of CHO cells stably expressing mouse Prostaglandin D2 receptor
In DepthDetails ArticlePubMed
TargetProstaglandin E2 receptor EP2 subtype(Mus musculus (Mouse))
Minase Research Institute
Curated by ChEMBL
LigandPNGBDBM50152514(CHEMBL365829 | {1-[4-(Chroman-2-ylmethoxy)-benzoyl...)
Affinity DataKi:  90nM. Assay description: Ability to inhibit the binding of [3H]-PGD-2 radioligand to membranes of CHO cells stably expressing mouse Prostaglandin E receptor EP2
In DepthDetails ArticlePubMed
TargetProstaglandin E2 receptor EP4 subtype(Mus musculus (Mouse))
Minase Research Institute
Curated by ChEMBL
LigandPNGBDBM50152514(CHEMBL365829 | {1-[4-(Chroman-2-ylmethoxy)-benzoyl...)
Affinity DataKi:  3.10E+3nM. Assay description: Ability to inhibit the binding of [3H]-PGD-2 radioligand to membranes of CHO cells stably expressing mouse Prostaglandin E receptor EP4
In DepthDetails ArticlePubMed
TargetProstaglandin E2 receptor EP1 subtype(Mus musculus (Mouse))
Minase Research Institute
Curated by ChEMBL
LigandPNGBDBM50152514(CHEMBL365829 | {1-[4-(Chroman-2-ylmethoxy)-benzoyl...)
Affinity DataKi:  3.80E+3nM. Assay description: Ability to inhibit the binding of [3H]-PGD-2 radioligand to membranes of CHO cells stably expressing mouse Prostaglandin E receptor EP1
In DepthDetails ArticlePubMed
TargetProstaglandin E2 receptor EP3 subtype(Mus musculus (Mouse))
Minase Research Institute
Curated by ChEMBL
LigandPNGBDBM50152514(CHEMBL365829 | {1-[4-(Chroman-2-ylmethoxy)-benzoyl...)
Affinity DataKi: >1.00E+4nM. Assay description: Ability to inhibit the binding of [3H]-PGD-2 radioligand to membranes of CHO cells stably expressing mouse Prostaglandin E receptor EP3
In DepthDetails ArticlePubMed
TargetProstaglandin D2 receptor(Homo sapiens (Human))
Minase Research Institute
Curated by ChEMBL
LigandPNGBDBM50152514(CHEMBL365829 | {1-[4-(Chroman-2-ylmethoxy)-benzoyl...)
Affinity DataIC50:  30nM. Assay description: Effect on the increase in cAMP formation induced by PGD-2 in the presence of bovine serum albumin in CHO cells expressing human Prostaglandin D2 rece...
In DepthDetails ArticlePubMed