BDBM50153613 4-[4-(4-Chloro-3-trifluoromethyl-phenyl)-4-hydroxy-piperidin-1-yl]-2,2-diphenyl-butyric acid methyl ester::CHEMBL186938
SMILES COC(=O)C(CCN1CCC(O)(CC1)c1ccc(Cl)c(c1)C(F)(F)F)(c1ccccc1)c1ccccc1
InChI Key InChIKey=WEHXYCJSKSNRKW-UHFFFAOYSA-N
Data  2 KI
  Tab Delimited (TSV)   2D SDfile   Computed 3D by Vconf -m prep SDfile
Find this compound or compounds like it in BindingDB:
Activity Spreadsheet -- Enzyme Inhibition Constant Data from BindingDB
Found 2 hits for monomerid = 50153613
TargetMu-type opioid receptor(Homo sapiens (Human))
Purdue Pharma
Curated by ChEMBL
LigandPNGBDBM50153613(4-[4-(4-Chloro-3-trifluoromethyl-phenyl)-4-hydroxy...)
Affinity DataKi:  0.300nM. Assay description: Binding affinity for recombinant human mu-opioid receptor was determined by using [3H]- diprenophine radioligand
In DepthDetails ArticlePubMed
TargetNociceptin receptor(Homo sapiens (Human))
Purdue Pharma
Curated by ChEMBL
LigandPNGBDBM50153613(4-[4-(4-Chloro-3-trifluoromethyl-phenyl)-4-hydroxy...)
Affinity DataKi:  149nM. Assay description: Binding affinity for opioid receptor like 1 expressed in HEK-293 cells
In DepthDetails ArticlePubMed