BDBM50157782 CHEMBL225441::N-(8-methoxy-1,2,3,4-tetrahydronaphthalen-1-yl)-4-(2-methoxyphenyl)-1-piperazinepentanamide
SMILES COc1ccccc1N1CCN(CCCCC(=O)NC2CCCc3cccc(OC)c23)CC1
InChI Key InChIKey=BUMLEIQSRWKWTF-UHFFFAOYSA-N
Data  2 KI
  Tab Delimited (TSV)   2D SDfile   Computed 3D by Vconf -m prep SDfile
Find this compound or compounds like it in BindingDB:
Activity Spreadsheet -- Enzyme Inhibition Constant Data from BindingDB
Found 2 hits for monomerid = 50157782
Target5-hydroxytryptamine receptor 7(Rattus norvegicus (rat))
Università
Curated by ChEMBL
LigandPNGBDBM50157782(CHEMBL225441 | N-(8-methoxy-1,2,3,4-tetrahydronaph...)
Affinity DataKi:  64nM. Assay description: Displacement of [3H]LSD from rat recombinant 5HT7 receptor expressed in HEK293 cells
In DepthDetails ArticlePubMed
Target5-hydroxytryptamine receptor 1A(Rattus norvegicus (rat))
Università
Curated by ChEMBL
LigandPNGBDBM50157782(CHEMBL225441 | N-(8-methoxy-1,2,3,4-tetrahydronaph...)
Affinity DataKi:  72nM. Assay description: Displacement of [3H]8-OH-DPAT from 5HT1A receptor in Wistar Han rat hippocampal membranes
In DepthDetails ArticlePubMed