BDBM50163543 2-{2-[4-(8-Methyl-2-oxo-4H-benzo[d][1,3]oxazin-1-yl)-piperidin-1-yl]-acetylamino}-benzoic acid methyl ester::CHEMBL193554
SMILES COC(=O)c1ccccc1NC(=O)CN1CCC(CC1)N1C(=O)OCc2cccc(C)c12
InChI Key InChIKey=KAXIAXHHJUTKKU-UHFFFAOYSA-N
Data  1 IC50
  Tab Delimited (TSV)   2D SDfile   Computed 3D by Vconf -m prep SDfile
Find this compound or compounds like it in BindingDB:
Activity Spreadsheet -- Enzyme Inhibition Constant Data from BindingDB
Found 1 hit for monomerid = 50163543
TargetNeuropeptide Y receptor type 5(Rat 6B)
Laboratorios Dr. Esteve
Curated by ChEMBL
LigandPNGBDBM50163543(2-{2-[4-(8-Methyl-2-oxo-4H-benzo[d][1,3]oxazin-1-y...)
Affinity DataIC50: >1.00E+3nM. Assay description: Inhibition of [125I]PYY binding to the rat NPY Y5 receptor in C6 cells
In DepthDetails ArticlePubMed