BDBM50164779 (4R,4aS,5S)-4-Methyl-octahydro-quinolin-(2E)-ylideneamine::CHEMBL365804
SMILES C[C@@H]1CC(N)=N[C@H]2CCCC[C@@H]12
InChI Key InChIKey=WFMGCLWNKZKHCB-VGMNWLOBSA-N
Data  3 IC50
  Tab Delimited (TSV)   2D SDfile   Computed 3D by Vconf -m prep SDfile
Find this compound or compounds like it in BindingDB:
Activity Spreadsheet -- Enzyme Inhibition Constant Data from BindingDB
Found 3 hits for monomerid = 50164779
TargetNitric oxide synthase, endothelial(Homo sapiens (Human))
Merck Research Laboratories
Curated by ChEMBL
LigandPNGBDBM50164779((4R,4aS,5S)-4-Methyl-octahydro-quinolin-(2E)-ylide...)
Affinity DataIC50:  2.00E+3nM. Assay description: Inhibitory activity against human Endothelial nitric oxide synthase (eNOS)
In DepthDetails ArticlePubMed
TargetNitric oxide synthase, brain(Homo sapiens (Human))
Merck Research Laboratories
Curated by ChEMBL
LigandPNGBDBM50164779((4R,4aS,5S)-4-Methyl-octahydro-quinolin-(2E)-ylide...)
Affinity DataIC50:  190nM. Assay description: Inhibitory activity against human Neuronal nitric oxide synthase (nNOS)
In DepthDetails ArticlePubMed
TargetNitric oxide synthase, inducible(Homo sapiens (Human))
Merck Research Laboratories
Curated by ChEMBL
LigandPNGBDBM50164779((4R,4aS,5S)-4-Methyl-octahydro-quinolin-(2E)-ylide...)
Affinity DataIC50:  38nM. Assay description: Inhibitory activity against human Inducible nitric oxide synthase (iNOS)
In DepthDetails ArticlePubMed