BDBM50175522 1-{2-[3-((S)-3,4-Dichloro-phenyl)-1-(3,4,5-trimethoxy-benzoyl)-pyrrolidin-3-yl]-ethyl}-4-phenyl-piperidine-4-carboxylic acid amide::CHEMBL372587::MDL 105,212 (R)-enantiomer
SMILES COc1cc(cc(OC)c1OC)C(=O)N1CC[C@](CCN2CCC(CC2)(C(N)=O)c2ccccc2)(C1)c1ccc(Cl)c(Cl)c1
InChI Key InChIKey=WZMVQZJKOVPVGZ-MGBGTMOVSA-N
Data  7 KI  2 IC50
  Tab Delimited (TSV)   2D SDfile   Computed 3D by Vconf -m prep SDfile
Find this compound or compounds like it in BindingDB:
Activity Spreadsheet -- Enzyme Inhibition Constant Data from BindingDB
Found 9 hits for monomerid = 50175522
TargetSubstance-P receptor(GUINEA PIG)
Hoechst Marion Roussel
Curated by PDSP Ki Database
LigandPNGBDBM50175522(1-{2-[3-((S)-3,4-Dichloro-phenyl)-1-(3,4,5-trimeth...)
Affinity DataKi:  2.12nM
In DepthDetails PubMed
TargetSubstance-P receptor(Homo sapiens (Human))
Hoechst Marion Roussel
Curated by PDSP Ki Database
LigandPNGBDBM50175522(1-{2-[3-((S)-3,4-Dichloro-phenyl)-1-(3,4,5-trimeth...)
Affinity DataKi:  3.11nM
In DepthDetails PubMed
TargetSubstance-K receptor(HAMSTER)
Hoechst Marion Roussel
Curated by PDSP Ki Database
LigandPNGBDBM50175522(1-{2-[3-((S)-3,4-Dichloro-phenyl)-1-(3,4,5-trimeth...)
Affinity DataKi:  6.98nM
In DepthDetails PubMed
TargetSubstance-K receptor(Homo sapiens (Human))
Hoechst Marion Roussel
Curated by PDSP Ki Database
LigandPNGBDBM50175522(1-{2-[3-((S)-3,4-Dichloro-phenyl)-1-(3,4,5-trimeth...)
Affinity DataKi:  8.40nM
In DepthDetails PubMed
TargetSubstance-K receptor(Bos taurus)
Hoechst Marion Roussel
Curated by PDSP Ki Database
LigandPNGBDBM50175522(1-{2-[3-((S)-3,4-Dichloro-phenyl)-1-(3,4,5-trimeth...)
Affinity DataKi:  8.49nM
In DepthDetails PubMed
TargetNeuromedin-K receptor(GUINEA PIG)
Hoechst Marion Roussel
Curated by PDSP Ki Database
LigandPNGBDBM50175522(1-{2-[3-((S)-3,4-Dichloro-phenyl)-1-(3,4,5-trimeth...)
Affinity DataKi:  21nM
In DepthDetails PubMed
TargetSubstance-P receptor(Rattus norvegicus (rat))
Hoechst Marion Roussel
Curated by PDSP Ki Database
LigandPNGBDBM50175522(1-{2-[3-((S)-3,4-Dichloro-phenyl)-1-(3,4,5-trimeth...)
Affinity DataKi:  408nM
In DepthDetails PubMed
TargetSubstance-K receptor(Homo sapiens (Human))
Hoechst Marion Roussel
Curated by PDSP Ki Database
LigandPNGBDBM50175522(1-{2-[3-((S)-3,4-Dichloro-phenyl)-1-(3,4,5-trimeth...)
Affinity DataIC50:  8.40nM. Assay description: Inhibitory concentration against tachykinin receptor 2
In DepthDetails ArticlePubMed
TargetSubstance-P receptor(Homo sapiens (Human))
Hoechst Marion Roussel
Curated by PDSP Ki Database
LigandPNGBDBM50175522(1-{2-[3-((S)-3,4-Dichloro-phenyl)-1-(3,4,5-trimeth...)
Affinity DataIC50:  3.10nM. Assay description: Inhibitory concentration against tachykinin receptor 1
In DepthDetails ArticlePubMed