BDBM50183369 CHEMBL3818625
SMILES COC(=O)[C@@H](NC(=O)c1cc(-c2c(OC)cccc2OC)n(n1)-c1ccc(F)cc1)C1CCCCC1
InChI Key InChIKey=CDUCTPJOMINZRB-VWLOTQADSA-N
Data  1 EC50
  Tab Delimited (TSV)   2D SDfile   Computed 3D by Vconf -m prep SDfile
Find this compound or compounds like it in BindingDB:
Activity Spreadsheet -- Enzyme Inhibition Constant Data from BindingDB
Found 1 hit for monomerid = 50183369
TargetApelin receptor(Homo sapiens (Human))
Rti International
Curated by ChEMBL
LigandPNGBDBM50183369(CHEMBL3818625)
Affinity DataEC50: >3.00E+4nM. Assay description: Agonist activity at human APJ receptor expressed in cells c-expressing Galphaq16 assessed as calcium mobilization by FLIPR assay
In DepthDetails ArticlePubMed