BDBM50184706 CHEMBL379787::N-(1-(2-morpholinoethyl)-1H-benzo[d]imidazol-2-yl)-3-nitrobenzamide
SMILES [O-][N+](=O)c1cccc(c1)C(=O)Nc1nc2ccccc2n1CCN1CCOCC1
InChI Key InChIKey=QTCFYQHZJIIHBS-UHFFFAOYSA-N
Data  2 IC50
  Tab Delimited (TSV)   2D SDfile   Computed 3D by Vconf -m prep SDfile
Find this compound or compounds like it in BindingDB:
Activity Spreadsheet -- Enzyme Inhibition Constant Data from BindingDB
Found 2 hits for monomerid = 50184706
TargetInterleukin-1 receptor-associated kinase 1(Homo sapiens (Human))
Amgen
Curated by ChEMBL
LigandPNGBDBM50184706(CHEMBL379787 | N-(1-(2-morpholinoethyl)-1H-benzo[d...)
Affinity DataIC50:  300nM. Assay description: Inhibition of IRAK1
In DepthDetails ArticlePubMed
TargetInterleukin-1 receptor-associated kinase 4(Homo sapiens (Human))
Amgen
Curated by ChEMBL
LigandPNGBDBM50184706(CHEMBL379787 | N-(1-(2-morpholinoethyl)-1H-benzo[d...)
Affinity DataIC50:  200nM. Assay description: Inhibition of IRAK4
In DepthDetails ArticlePubMed