BDBM50186892 (R)-N-((2-(4-(2-(3-aminopropanamido)-3-(2,4-dichlorophenyl)propanoyl)piperazin-1-yl)pyridin-3-yl)methyl)benzamide::CHEMBL441532
SMILES NCCC(=O)N[C@H](Cc1ccc(Cl)cc1Cl)C(=O)N1CCN(CC1)c1ncccc1CNC(=O)c1ccccc1
InChI Key InChIKey=AHEQLHPQBXIPCC-RUZDIDTESA-N
Data  1 KI
  Tab Delimited (TSV)   2D SDfile   Computed 3D by Vconf -m prep SDfile
Find this compound or compounds like it in BindingDB:
Activity Spreadsheet -- Enzyme Inhibition Constant Data from BindingDB
Found 1 hit for monomerid = 50186892
TargetMelanocortin receptor 4(Homo sapiens (Human))
Neurocrine Biosciences
Curated by ChEMBL
LigandPNGBDBM50186892((R)-N-((2-(4-(2-(3-aminopropanamido)-3-(2,4-dichlo...)
Affinity DataKi:  1.80E+3nM. Assay description: Displacement of [125I]NDP-MSH from human MC4R expressed in HEK293 cells
In DepthDetails ArticlePubMed