BDBM50190150 CHEMBL3827209
SMILES [H][C@]12Oc3c(c(ccc3C)[C@@H](C)OC[C@H](O)CNC(C)(C)Cc3ccc(SC)cc3)[C@@]1([H])[C@@H]2C(O)=O
InChI Key InChIKey=BKJYABGDJXCRTG-XFRQHDKRSA-N
Data  1 IC50
  Tab Delimited (TSV)   2D SDfile   Computed 3D by Vconf -m prep SDfile
Find this compound or compounds like it in BindingDB:
Activity Spreadsheet -- Enzyme Inhibition Constant Data from BindingDB
Found 1 hit for monomerid = 50190150
TargetExtracellular calcium-sensing receptor(Homo sapiens (Human))
Merck Research Laboratories
Curated by ChEMBL
LigandPNGBDBM50190150(CHEMBL3827209)
Affinity DataIC50:  39nM. Assay description: Antagonist activity at calcium sensing receptor (unknown origin) by cell based FLIPR assay
In DepthDetails ArticlePubMed