BDBM50191883 1-adamantan-1-yl-3-(1-ethyl-piperidin-4-ylmethyl)-urea::CHEMBL213611
SMILES CCN1CCC(CNC(=O)NC23CC4CC(CC(C4)C2)C3)CC1
InChI Key InChIKey=ZHSUSCSBZVZJBY-UHFFFAOYSA-N
Data  1 IC50
  Tab Delimited (TSV)   2D SDfile   Computed 3D by Vconf -m prep SDfile
Find this compound or compounds like it in BindingDB:
Activity Spreadsheet -- Enzyme Inhibition Constant Data from BindingDB
Found 1 hit for monomerid = 50191883
TargetBifunctional epoxide hydrolase 2(Homo sapiens (Human))
University Of California
Curated by ChEMBL
LigandPNGBDBM50191883(1-adamantan-1-yl-3-(1-ethyl-piperidin-4-ylmethyl)-...)
Affinity DataIC50:  3.90E+3nM. Assay description: Inhibition of soluble epoxide hydroxylase by kinetic fluorescent assay
In DepthDetails ArticlePubMed