BDBM50192285 CHEMBL3958494::US10239870, Example 16
SMILES Cc1ncoc1-c1nnc(SCCCN2CC[C@]3(C[C@H]3c3ccccc3)C2)n1C
InChI Key InChIKey=AAPXNHMQKBDDJN-AVRDEDQJSA-N
Data  6 KI  1 IC50
  Tab Delimited (TSV)   2D SDfile   Computed 3D by Vconf -m prep SDfile
Find this compound or compounds like it in BindingDB:
Activity Spreadsheet -- Enzyme Inhibition Constant Data from BindingDB
Found 7 hits for monomerid = 50192285
TargetD(3) dopamine receptor(Homo sapiens (Human))
Aptuit
Curated by ChEMBL
LigandPNGBDBM50192285(CHEMBL3958494 | US10239870, Example 16)
Affinity DataKi:  28nM. Assay description: Displacement of [3H]-spiperone from human dopamine D3 receptor expressed in CHO-K1 cell membranes after 90 mins by liquid scintillation counting
In DepthDetails ArticlePubMed
TargetD(3) dopamine receptor(Homo sapiens (Human))
Aptuit
Curated by ChEMBL
LigandPNGBDBM50192285(CHEMBL3958494 | US10239870, Example 16)
Affinity DataKi:  28.2nM. Assay description: Displacement of [3H]-spiperone from human dopamine D3 receptor expressed in CHO-K1 cell membranes after 90 mins by liquid scintillation counting
In DepthDetails ArticlePubMed
TargetD(3) dopamine receptor(Rattus norvegicus (Rat))
Indivior
US Patent
LigandPNGBDBM50192285(CHEMBL3958494 | US10239870, Example 16)
Affinity DataKi:  41.7nM. Assay description: [125I]-7OH-PIPAT Binding Assay at rat native D3 receptor on membranes from rat ventral striatum. Homogenates from frozen rat brain ventral striatum (...
In DepthDetails US Patent
TargetD(2) dopamine receptor(Homo sapiens (Human))
Aptuit
Curated by ChEMBL
LigandPNGBDBM50192285(CHEMBL3958494 | US10239870, Example 16)
Affinity DataKi:  999nM. Assay description: Displacement of [3H]-spiperone from human dopamine D2 receptor expressed in CHO-K1 cell membranes coexpressing Galpha16 after 120 mins by liquid scin...
In DepthDetails ArticlePubMed
TargetD(2) dopamine receptor(Homo sapiens (Human))
Aptuit
Curated by ChEMBL
LigandPNGBDBM50192285(CHEMBL3958494 | US10239870, Example 16)
Affinity DataKi:  1.00E+3nM. Assay description: Displacement of [3H]-spiperone from human dopamine D2 receptor expressed in CHO-K1 cell membranes coexpressing Galpha16 after 120 mins by liquid scin...
In DepthDetails ArticlePubMed
TargetD(2) dopamine receptor(Homo sapiens (Human))
Aptuit
Curated by ChEMBL
LigandPNGBDBM50192285(CHEMBL3958494 | US10239870, Example 16)
Affinity DataKi:  1.45E+3nM. Assay description: CHO cells stably expressing human dopamine receptor type 2, long variant (hD2L), coupled to Gα16 protein (CHO-Gα16-hD2L) were seeded into b...
In DepthDetails US Patent
TargetPotassium voltage-gated channel subfamily H member 2(Homo sapiens (Human))
Aptuit
Curated by ChEMBL
LigandPNGBDBM50192285(CHEMBL3958494 | US10239870, Example 16)
Affinity DataIC50:  3.98E+3nM. Assay description: Inhibition of human ERG transfected in HEK293 cells assessed as reduction in tail current by patch clamp assay
In DepthDetails ArticlePubMed