BDBM50193977 1-[4-chloro-3-(dimethylsulfamoyl)-2-hydroxyphenyl]-2-cyano-3-(2-phenylphenyl)guanidine::CHEMBL425985
SMILES CN(C)S(=O)(=O)c1c(Cl)ccc(N=C(NC#N)Nc2ccccc2-c2ccccc2)c1O
InChI Key InChIKey=IYZWLQHDOCJREA-UHFFFAOYSA-N
Data  2 IC50
  Tab Delimited (TSV)   2D SDfile   Computed 3D by Vconf -m prep SDfile
Find this compound or compounds like it in BindingDB:
Activity Spreadsheet -- Enzyme Inhibition Constant Data from BindingDB
Found 2 hits for monomerid = 50193977
TargetC-X-C chemokine receptor type 2(Homo sapiens (Human))
Glaxosmithkline
Curated by ChEMBL
LigandPNGBDBM50193977(1-[4-chloro-3-(dimethylsulfamoyl)-2-hydroxyphenyl]...)
Affinity DataIC50:  13nM. Assay description: Displacement of [125I]IL8 from CXCR2 expressed in CHO cells
In DepthDetails ArticlePubMed
TargetC-X-C chemokine receptor type 1(Homo sapiens (Human))
Glaxosmithkline
Curated by ChEMBL
LigandPNGBDBM50193977(1-[4-chloro-3-(dimethylsulfamoyl)-2-hydroxyphenyl]...)
Affinity DataIC50:  752nM. Assay description: Displacement of [125I]IL8 from CXCR1 expressed in CHO cells
In DepthDetails ArticlePubMed