BDBM50194163 (2R,3R,4S,5R)-1-(3-amino-5-(diphosphoryloxymethyl)-4-hydroxytetrahydrofuran-2-yl)pyrimidine-2,4(1H,3H)-dione::CHEMBL215911
SMILES N[C@@H]1[C@H](O)[C@@H](COP(O)(=O)OP(O)(O)=O)O[C@H]1n1ccc(=O)[nH]c1=O
InChI Key InChIKey=DEYDGUCDMRYBLU-XVFCMESISA-N
Data  1 EC50
  Tab Delimited (TSV)   2D SDfile   Computed 3D by Vconf -m prep SDfile
Find this compound or compounds like it in BindingDB:
Activity Spreadsheet -- Enzyme Inhibition Constant Data from BindingDB
Found 1 hit for monomerid = 50194163
TargetP2Y purinoceptor 6(Homo sapiens (Human))
National Institute Of Diabetes And Digestive And Kidney Diseases
Curated by ChEMBL
LigandPNGBDBM50194163((2R,3R,4S,5R)-1-(3-amino-5-(diphosphoryloxymethyl)...)
Affinity DataEC50:  3.90E+3nM. Assay description: Agonist activity at human recombinant P2Y6 receptor expressed in 1321N1 cells assessed as PLC-mediated [3H]IP production
In DepthDetails ArticlePubMed