BDBM50195526 CHEMBL385508::N-cyclopentyl-7-methyl-1-(2-morpholin-4-ylethyl)-1,8-naphthyridin-4(1H)-on-3-carboxamide
SMILES Cc1ccc2c(n1)n(CCN1CCOCC1)cc(C(=O)NC1CCCC1)c2=O
InChI Key InChIKey=BNHUMMLUSHLSRT-UHFFFAOYSA-N
Data  4 KI
  Tab Delimited (TSV)   2D SDfile   Computed 3D by Vconf -m prep SDfile
Find this compound or compounds like it in BindingDB:
Activity Spreadsheet -- Enzyme Inhibition Constant Data from BindingDB
Found 4 hits for monomerid = 50195526
TargetCannabinoid receptor 2(Homo sapiens (Human))
Universit£
Curated by ChEMBL
LigandPNGBDBM50195526(CHEMBL385508 | N-cyclopentyl-7-methyl-1-(2-morphol...)
Affinity DataKi:  50nM. Assay description: Displacement of [3H]CP 55940 from human CB2 receptor in cell free system
In DepthDetails ArticlePubMed
TargetCannabinoid receptor 2(MOUSE)
Universit£
Curated by ChEMBL
LigandPNGBDBM50195526(CHEMBL385508 | N-cyclopentyl-7-methyl-1-(2-morphol...)
Affinity DataKi:  50nM. Assay description: Displacement of [3H]CP-55940 from CB2 receptor in DBA/J2 mouse spleen
In DepthDetails ArticlePubMed
TargetCannabinoid receptor 1(Mus musculus (Mouse))
Universit£
Curated by ChEMBL
LigandPNGBDBM50195526(CHEMBL385508 | N-cyclopentyl-7-methyl-1-(2-morphol...)
Affinity DataKi: >1.00E+3nM. Assay description: Displacement of [3H]CP-55940 from CB1 receptor in DBA/J2 mouse brain
In DepthDetails ArticlePubMed
TargetCannabinoid receptor 1(Homo sapiens (Human))
Universit£
Curated by ChEMBL
LigandPNGBDBM50195526(CHEMBL385508 | N-cyclopentyl-7-methyl-1-(2-morphol...)
Affinity DataKi:  1.00E+3nM. Assay description: Displacement of [3H]CP 55940 from human CB1 receptor in cell free system
In DepthDetails ArticlePubMed