BDBM50196122 CHEMBL217366::GNF-PF-3878::N-(4-(4-ethylpiperazin-1-yl)phenyl)acridin-9-amine::TCMDC-124255
SMILES CCN1CCN(CC1)c1ccc(Nc2c3ccccc3nc3ccccc23)cc1
InChI Key InChIKey=CUVBGWMAORETGV-UHFFFAOYSA-N
Data  4 KI
  Tab Delimited (TSV)   2D SDfile   Computed 3D by Vconf -m prep SDfile
Find this compound or compounds like it in BindingDB:
Activity Spreadsheet -- Enzyme Inhibition Constant Data from BindingDB
Found 4 hits for monomerid = 50196122
TargetAlpha-2C adrenergic receptor(Homo sapiens (Human))
Timisoara Of The Romanian Academy
Curated by ChEMBL
LigandPNGBDBM50196122(CHEMBL217366 | GNF-PF-3878 | N-(4-(4-ethylpiperazi...)
Affinity DataKi:  37.0nM. Assay description: Binding affinity to human cloned Alpha-2C adrenergic receptor
In DepthDetails ArticlePubMed
TargetAlpha-2C adrenergic receptor(Homo sapiens (Human))
Timisoara Of The Romanian Academy
Curated by ChEMBL
LigandPNGBDBM50196122(CHEMBL217366 | GNF-PF-3878 | N-(4-(4-ethylpiperazi...)
Affinity DataKi:  37nM. Assay description: Displacement of [3H]rauwolscine from human ADRA2C expressed in S115 cells
In DepthDetails ArticlePubMed
TargetAlpha-2B adrenergic receptor(Homo sapiens (Human))
Juvantia Pharma
Curated by ChEMBL
LigandPNGBDBM50196122(CHEMBL217366 | GNF-PF-3878 | N-(4-(4-ethylpiperazi...)
Affinity DataKi:  1.20E+3nM. Assay description: Displacement of [3H]rauwolscine from human ADRA2B expressed in S115 cells
In DepthDetails ArticlePubMed
TargetAlpha-2A adrenergic receptor(Homo sapiens (Human))
Juvantia Pharma
Curated by ChEMBL
LigandPNGBDBM50196122(CHEMBL217366 | GNF-PF-3878 | N-(4-(4-ethylpiperazi...)
Affinity DataKi:  3.60E+3nM. Assay description: Displacement of [3H]rauwolscine from human ADRA2A expressed in S115 cells
In DepthDetails ArticlePubMed