BDBM50199474 CHEMBL3959210
SMILES [H][C@]12C[C@@]1(CO)[C@@H](O)[C@@H](O)[C@@H]2n1cnc2c(nc(Cl)nc12)N(C)C
InChI Key InChIKey=BSBLYPMZOLQTAO-RUVJYUCVSA-N
Data  4 KI
  Tab Delimited (TSV)   2D SDfile   Computed 3D by Vconf -m prep SDfile
Find this compound or compounds like it in BindingDB:
Activity Spreadsheet -- Enzyme Inhibition Constant Data from BindingDB
Found 4 hits for monomerid = 50199474
TargetTransmembrane domain-containing protein TMIGD3(Homo sapiens (Human))
National Institute Of Diabetes And Digestive And Kidney Diseases
Curated by ChEMBL
LigandPNGBDBM50199474(CHEMBL3959210)
Affinity DataKi:  2.47E+3nM. Assay description: Displacement of [125l]N 6-(4-amino-3-iodobenzyl)adenosine-5'-N-methyluronamide from recombinant human A3AR expressed in CHO cell membranes after 60 m...
In DepthDetails ArticlePubMed
Target5-hydroxytryptamine receptor 2B(Homo sapiens (Human))
National Institute Of Diabetes And Digestive And Kidney Diseases
Curated by ChEMBL
LigandPNGBDBM50199474(CHEMBL3959210)
Affinity DataKi:  4.80E+3nM. Assay description: Displacement of [3H]lysergic from human 5-HT2BR expressed in HEK cell membranes incubated in dark for 90 mins by microbeta scintillation counting met...
In DepthDetails ArticlePubMed
Target5-hydroxytryptamine receptor 2C(Homo sapiens (Human))
National Institute Of Diabetes And Digestive And Kidney Diseases
Curated by ChEMBL
LigandPNGBDBM50199474(CHEMBL3959210)
Affinity DataKi:  8.10E+3nM. Assay description: Displacement of [3H]mesulergine from human 5-HT2CR expressed in Flp-In HEK cell membranes incubated for 90 mins under dark condition by microbeta sci...
In DepthDetails ArticlePubMed
Target5-hydroxytryptamine receptor 2A(Homo sapiens (Human))
National Institute Of Diabetes And Digestive And Kidney Diseases
Curated by ChEMBL
LigandPNGBDBM50199474(CHEMBL3959210)
Affinity DataKi: >1.00E+4nM. Assay description: Displacement of [3H]ketanserin from human 5-HT2A receptor expressed in HEK-T cell membranes incubated for 90 mins under dark condition by microbeta s...
In DepthDetails ArticlePubMed