BDBM50200482 CHEMBL3978393
SMILES [H][C@]1(CC[C@@H](C)c2ccc(C)nc12)[C@@H](C)C(=O)Nc1ccc(Cl)c(c1)-c1nc2ccc(OC(F)(F)F)cc2n1C
InChI Key InChIKey=BGMHGWBNXBMNQS-CEQIKUNHSA-N
Data  1 IC50
  Tab Delimited (TSV)   2D SDfile   Computed 3D by Vconf -m prep SDfile
Find this compound or compounds like it in BindingDB:
Activity Spreadsheet -- Enzyme Inhibition Constant Data from BindingDB
Found 1 hit for monomerid = 50200482
TargetSmoothened homolog(Mus musculus)
University Of Chinese Academy Of Sciences
Curated by ChEMBL
LigandPNGBDBM50200482(CHEMBL3978393)
Affinity DataIC50:  53nM. Assay description: Inhibition of Smo-mediated Hh signalling pathway in mouse Shh Light2 cells by Gli-luciferase reporter gene assay
In DepthDetails ArticlePubMed