BDBM50203818 3-(1-(3-aminopropyl)-1H-indazol-3-yl)-4-(1-(benzo[b]thiophen-3-yl)-1H-indol-3-yl)-1H-pyrrole-2,5-dione::CHEMBL218690::JNJ-8706646
SMILES NCCCn1nc(C2=C(C(=O)NC2=O)c2cn(-c3csc4ccccc34)c3ccccc23)c2ccccc12
InChI Key InChIKey=ANUONHHEYSLORP-UHFFFAOYSA-N
Data  1 KI
  Tab Delimited (TSV)   2D SDfile   Computed 3D by Vconf -m prep SDfile
Find this compound or compounds like it in BindingDB:
Activity Spreadsheet -- Enzyme Inhibition Constant Data from BindingDB
Found 1 hit for monomerid = 50203818
TargetKiSS-1 receptor(Homo sapiens (Human))
University Of Minnesota Health Science Center
Curated by ChEMBL
LigandPNGBDBM50203818(3-(1-(3-aminopropyl)-1H-indazol-3-yl)-4-(1-(benzo[...)
Affinity DataKi:  708nM. Assay description: Displacement of [125]metastin from metastin receptor
In DepthDetails ArticlePubMed