BDBM50203889 CHEMBL426207::ethyl 4-({[4-(benzoyloxy)-1-naphthyl]sulfonyl}amino)-piperidine-1-carboxylate
SMILES CCOC(=O)N1CCC(CC1)NS(=O)(=O)c1ccc(OC(=O)c2ccccc2)c2ccccc12
InChI Key InChIKey=CZNQUIPMFXMQEZ-UHFFFAOYSA-N
Data  1 KI
  Tab Delimited (TSV)   2D SDfile   Computed 3D by Vconf -m prep SDfile
Find this compound or compounds like it in BindingDB:
Activity Spreadsheet -- Enzyme Inhibition Constant Data from BindingDB
Found 1 hit for monomerid = 50203889
TargetC-C chemokine receptor type 8(Homo sapiens (Human))
Millennium Pharmaceuticals
Curated by ChEMBL
LigandPNGBDBM50203889(CHEMBL426207 | ethyl 4-({[4-(benzoyloxy)-1-naphthy...)
Affinity DataKi:  16.4nM. Assay description: Binding affinity to human CCR8 expressed in L1.2 cells by FMAT assay
In DepthDetails ArticlePubMed