BDBM50205742 (S)-3-((R)-2-acetamidohexanamido)-4-(2-((S)-1-((S)-1-((S)-1-((S)-1,6-diamino-1-oxohexan-2-ylamino)-3-(1H-indol-3-yl)-1-oxopropan-2-ylamino)-5-guanidino-1-oxopentan-2-ylamino)-1-oxo-3-phenylpropan-2-yl)-3-oxo-2,3,4,5-tetrahydro-1H-benzo[c]azepin-4-ylamino)::CHEMBL234456
SMILES CCCC[C@@H](NC(C)=O)C(=O)N[C@@H](CC(O)=O)C(=O)NC1Cc2ccccc2CN([C@@H](Cc2ccccc2)C(=O)N[C@@H](CCCN=C(N)N)C(=O)N[C@@H](Cc2c[nH]c3ccccc23)C(=O)N[C@@H](CCCCN)C(N)=O)C1=O
InChI Key InChIKey=BXHDPGPLCWBTJR-OLTOIJSYSA-N
Data  4 IC50  4 EC50
  Tab Delimited (TSV)   2D SDfile   Computed 3D by Vconf -m prep SDfile
Find this compound or compounds like it in BindingDB:
Activity Spreadsheet -- Enzyme Inhibition Constant Data from BindingDB
Found 8 hits for monomerid = 50205742
TargetMelanocortin receptor 5(Homo sapiens (Human))
Vrije Universiteit Brussel
Curated by ChEMBL
LigandPNGBDBM50205742((S)-3-((R)-2-acetamidohexanamido)-4-(2-((S)-1-((S)...)
Affinity DataIC50: >1.00E+4nM. Assay description: Displacement of [125I]NDPalphaMSH from human MC5R expressed in HEK293 cells
In DepthDetails ArticlePubMed
TargetMelanocortin receptor 3(Homo sapiens (Human))
Vrije Universiteit Brussel
Curated by ChEMBL
LigandPNGBDBM50205742((S)-3-((R)-2-acetamidohexanamido)-4-(2-((S)-1-((S)...)
Affinity DataIC50: >1.00E+4nM. Assay description: Displacement of [125I]NDPalphaMSH from human MC3R expressed in HEK293 cells
In DepthDetails ArticlePubMed
TargetMelanocortin receptor 3(Homo sapiens (Human))
Vrije Universiteit Brussel
Curated by ChEMBL
LigandPNGBDBM50205742((S)-3-((R)-2-acetamidohexanamido)-4-(2-((S)-1-((S)...)
Affinity DataEC50: >1.00E+4nM. Assay description: Effect on human MC3R expressed in HEK293 cells assessed as intracellular cAMP accumulation
In DepthDetails ArticlePubMed
TargetMelanocortin receptor 5(Homo sapiens (Human))
Vrije Universiteit Brussel
Curated by ChEMBL
LigandPNGBDBM50205742((S)-3-((R)-2-acetamidohexanamido)-4-(2-((S)-1-((S)...)
Affinity DataEC50: >1.00E+4nM. Assay description: Effect on human MC5R expressed in HEK293 cells assessed as intracellular cAMP accumulation
In DepthDetails ArticlePubMed
TargetMelanocyte-stimulating hormone receptor(Homo sapiens (Human))
Vrije Universiteit Brussel
Curated by ChEMBL
LigandPNGBDBM50205742((S)-3-((R)-2-acetamidohexanamido)-4-(2-((S)-1-((S)...)
Affinity DataIC50: >1.00E+4nM. Assay description: Displacement of [125I]NDPalphaMSH from human MC1R expressed in HEK293 cells
In DepthDetails ArticlePubMed
TargetMelanocyte-stimulating hormone receptor(Homo sapiens (Human))
Vrije Universiteit Brussel
Curated by ChEMBL
LigandPNGBDBM50205742((S)-3-((R)-2-acetamidohexanamido)-4-(2-((S)-1-((S)...)
Affinity DataEC50: >1.00E+4nM. Assay description: Displacement of [125I]NDPalphaMSH from human MC1R expressed in HEK293 cells
In DepthDetails ArticlePubMed
TargetMelanocortin receptor 4(Homo sapiens (Human))
Vrije Universiteit Brussel
Curated by ChEMBL
LigandPNGBDBM50205742((S)-3-((R)-2-acetamidohexanamido)-4-(2-((S)-1-((S)...)
Affinity DataIC50: >1.00E+4nM. Assay description: Displacement of [125I]NDPalphaMSH from human MC4R expressed in HEK293 cells
In DepthDetails ArticlePubMed
TargetMelanocortin receptor 4(Homo sapiens (Human))
Vrije Universiteit Brussel
Curated by ChEMBL
LigandPNGBDBM50205742((S)-3-((R)-2-acetamidohexanamido)-4-(2-((S)-1-((S)...)
Affinity DataEC50: >1.00E+4nM. Assay description: Effect on human MC4R expressed in HEK293 cells assessed as intracellular cAMP accumulation
In DepthDetails ArticlePubMed