BDBM50207029 CHEMBL230375::tert-butyl 4-(4-(1H-indol-3-yl)butanoyl)piperazine-1-carboxylate
SMILES CC(C)(C)OC(=O)N1CCN(CC1)C(=O)CCCc1c[nH]c2ccccc12
InChI Key InChIKey=HPVMFLPLCWKVQM-UHFFFAOYSA-N
Data  1 IC50
  Tab Delimited (TSV)   2D SDfile   Computed 3D by Vconf -m prep SDfile
Find this compound or compounds like it in BindingDB:
Activity Spreadsheet -- Enzyme Inhibition Constant Data from BindingDB
Found 1 hit for monomerid = 50207029
TargetPolyunsaturated fatty acid 5-lipoxygenase(Rattus norvegicus)
Chinese Academy Of Sciences
Curated by ChEMBL
LigandPNGBDBM50207029(CHEMBL230375 | tert-butyl 4-(4-(1H-indol-3-yl)buta...)
Affinity DataIC50:  740nM. Assay description: Inhibition of 5-LOX in rat peritoneal leukocytes
In DepthDetails ArticlePubMed