BDBM50211500 (1S,3R)-N-{[3,5-bis(trifluoromethyl)phenyl]methyl}-1-methyl-3-{spiro[indene-1,4'-piperidine]-1'-yl}cyclopentane-1-carboxamide::CHEMBL388380
SMILES C[C@@]1(CC[C@H](C1)N1CCC2(CC1)C=Cc1ccccc21)C(=O)NCc1cc(cc(c1)C(F)(F)F)C(F)(F)F
InChI Key InChIKey=IPKKUXDCFVLCMQ-BVAGGSTKSA-N
Data  1 IC50
  Tab Delimited (TSV)   2D SDfile   Computed 3D by Vconf -m prep SDfile
Find this compound or compounds like it in BindingDB:
Activity Spreadsheet -- Enzyme Inhibition Constant Data from BindingDB
Found 1 hit for monomerid = 50211500
TargetC-C chemokine receptor type 2(Homo sapiens (Human))
Merck Research Laboratories
Curated by ChEMBL
LigandPNGBDBM50211500((1S,3R)-N-{[3,5-bis(trifluoromethyl)phenyl]methyl}...)
Affinity DataIC50:  47nM. Assay description: Displacement of [125]hMCP1 from human CCR2 receptor expressed in human monocytes
In DepthDetails ArticlePubMed