BDBM50212531 1-(4-chlorophenyl)-2-(phenylsulfonyl)ethanone::CHEMBL238834
SMILES Clc1ccc(cc1)C(=O)CS(=O)(=O)c1ccccc1
InChI Key InChIKey=KZACHGLUJYSTGQ-UHFFFAOYSA-N
Data  2 IC50
  Tab Delimited (TSV)   2D SDfile   Computed 3D by Vconf -m prep SDfile
Find this compound or compounds like it in BindingDB:
Activity Spreadsheet -- Enzyme Inhibition Constant Data from BindingDB
Found 2 hits for monomerid = 50212531
Target11-beta-hydroxysteroid dehydrogenase type 2(Homo sapiens (Human))
Wyeth Research
Curated by ChEMBL
LigandPNGBDBM50212531(1-(4-chlorophenyl)-2-(phenylsulfonyl)ethanone | CH...)
Affinity DataIC50: >2.00E+5nM. Assay description: Inhibition of human 11beta-HSD2 expressed in CHO cells
In DepthDetails ArticlePubMed
Target11-beta-hydroxysteroid dehydrogenase 1(Homo sapiens (Human))
Wyeth Research
Curated by ChEMBL
LigandPNGBDBM50212531(1-(4-chlorophenyl)-2-(phenylsulfonyl)ethanone | CH...)
Affinity DataIC50:  200nM. Assay description: Inhibition of human 11beta-HSD1 expressed in CHO cells
In DepthDetails ArticlePubMed