BDBM50214410 CHEMBL420459
SMILES CC(CC1CCCC1)N1c2ccccc2N(C(C)CC2CCCC2)C(=O)C(NC(=O)Nc2ccccc2)C1=O
InChI Key InChIKey=BFTFDRAHMJBMSG-UHFFFAOYSA-N
Data  2 KI
  Tab Delimited (TSV)   2D SDfile   Computed 3D by Vconf -m prep SDfile
Find this compound or compounds like it in BindingDB:
Activity Spreadsheet -- Enzyme Inhibition Constant Data from BindingDB
Found 2 hits for monomerid = 50214410
TargetGastrin/cholecystokinin type B receptor(Homo sapiens (Human))TBA
LigandPNGBDBM50214410(CHEMBL420459)
Affinity DataKi:  17nM. Assay description: Uncompetitive inhibition of human recombinant mitochondrial thymidine kinase 2 using thymidine as substrate by Lineweaver-Burk plotting
In DepthDetails
LigandPNGBDBM50214410(CHEMBL420459)
Affinity DataKi:  229nM. Assay description: Evaluated in vitro for Cholecystokinin type A receptor affinity by measuring its ability to displace tritiated CCK-8S bound on rat pancreas Cholecyst...
In DepthDetails