BDBM50217528 CHEMBL353596
SMILES COc1cc(cc(OC)c1OC)C(=O)N1CO[C@@](CCN2CCC3(CC2)[S+]([O-])Cc2ccccc32)(C1)c1ccc(Cl)cc1
InChI Key InChIKey=HFTDAWJFAQMENN-HYXMPAGBSA-N
Data  2 IC50
  Tab Delimited (TSV)   2D SDfile   Computed 3D by Vconf -m prep SDfile
Find this compound or compounds like it in BindingDB:
Activity Spreadsheet -- Enzyme Inhibition Constant Data from BindingDB
Found 2 hits for monomerid = 50217528
TargetSubstance-P receptor(GUINEA PIG)
Sankyo
Curated by ChEMBL
LigandPNGBDBM50217528(CHEMBL353596)
Affinity DataIC50:  12nM. Assay description: Inhibitory activity against Neurokinin 1 (NK1) receptor from guinea pig lung
In DepthDetails ArticlePubMed
TargetSubstance-K receptor(GUINEA PIG)
Sankyo
Curated by ChEMBL
LigandPNGBDBM50217528(CHEMBL353596)
Affinity DataIC50:  6.90nM. Assay description: Inhibitory activity against Neurokinin 2 (NK2) receptor from guinea pig ileum
In DepthDetails ArticlePubMed