BDBM50221128 CHEMBL412023::N-((S)-1-(2-(4-((R)-3-(2,4-dichlorophenyl)-2-(2-oxopyrrolidin-1-yl)propanoyl)piperazin-1-yl)-5-methylphenyl)-3-methylbutyl)-2-(methylamino)acetamide
SMILES CNCC(=O)N[C@@H](CC(C)C)c1cc(C)ccc1N1CCN(CC1)C(=O)[C@@H](Cc1ccc(Cl)cc1Cl)N1CCCC1=O
InChI Key InChIKey=AFKWCSONBYVREL-LMSSTIIKSA-N
Data  1 KI  1 IC50
  Tab Delimited (TSV)   2D SDfile   Computed 3D by Vconf -m prep SDfile
Find this compound or compounds like it in BindingDB:
Activity Spreadsheet -- Enzyme Inhibition Constant Data from BindingDB
Found 2 hits for monomerid = 50221128
TargetMelanocortin receptor 4(Homo sapiens (Human))
Neurocrine Biosciences
Curated by ChEMBL
LigandPNGBDBM50221128(CHEMBL412023 | N-((S)-1-(2-(4-((R)-3-(2,4-dichloro...)
Affinity DataKi:  1nM. Assay description: Binding affinity at human MC4R
In DepthDetails ArticlePubMed
TargetCytochrome P450 3A4(Homo sapiens (Human))
Neurocrine Biosciences
Curated by ChEMBL
LigandPNGBDBM50221128(CHEMBL412023 | N-((S)-1-(2-(4-((R)-3-(2,4-dichloro...)
Affinity DataIC50:  3.60E+3nM. Assay description: Inhibition of microsomal CYP3A4
In DepthDetails ArticlePubMed