BDBM50224723 CHEMBL237877::N,N-dimethyl-1-(2-(3-oxo-2,3-dihydrobenzo[b][1,4]oxazin-4-yl)ethyl)-4-phenylpiperidine-4-carboxamide
SMILES CN(C)C(=O)C1(CCN(CCN2C(=O)COc3ccccc23)CC1)c1ccccc1
InChI Key InChIKey=AEYWLHHXTQKUSX-UHFFFAOYSA-N
Data  1 IC50
  Tab Delimited (TSV)   2D SDfile   Computed 3D by Vconf -m prep SDfile
Find this compound or compounds like it in BindingDB:
Activity Spreadsheet -- Enzyme Inhibition Constant Data from BindingDB
Found 1 hit for monomerid = 50224723
TargetUrotensin-2 receptor(RAT)
Johnson & Johnson Pharmaceutical Research & Development
Curated by ChEMBL
LigandPNGBDBM50224723(CHEMBL237877 | N,N-dimethyl-1-(2-(3-oxo-2,3-dihydr...)
Affinity DataIC50:  2.40E+4nM. Assay description: Antagonist activity at rat UT receptor transfected in CHOK1 cells assessed as calcium mobilization by FLIPR method
In DepthDetails ArticlePubMed