BDBM50224768 2-chloro-N6-cyclopentyl-9H-(2-C-methyl-5-N-benzylcarbamoyl-beta-D-ribofuranosyl)adenine::CHEMBL400330
SMILES C[C@@]1(O)[C@H](O)[C@@H](COC(=O)NCc2ccccc2)O[C@H]1n1cnc2c(NC3CCCC3)nc(Cl)nc12
InChI Key InChIKey=BMRVDDGTZHJXLB-OVJGHYRJSA-N
Data  3 KI  1 EC50
  Tab Delimited (TSV)   2D SDfile   Computed 3D by Vconf -m prep SDfile
Find this compound or compounds like it in BindingDB:
Activity Spreadsheet -- Enzyme Inhibition Constant Data from BindingDB
Found 4 hits for monomerid = 50224768
TargetAdenosine receptor A1(BOVINE)
Universit£
Curated by ChEMBL
LigandPNGBDBM50224768(2-chloro-N6-cyclopentyl-9H-(2-C-methyl-5-N-benzylc...)
Affinity DataKi:  57nM. Assay description: Displacement of [3H]CCPA from adenosine A1 receptor in bovine cortical membrane
In DepthDetails ArticlePubMed
TargetAdenosine receptor A1(GUINEA PIG)
Universit£
Curated by ChEMBL
LigandPNGBDBM50224768(2-chloro-N6-cyclopentyl-9H-(2-C-methyl-5-N-benzylc...)
Affinity DataKi:  410nM. Assay description: Displacement of [3H]CCPA from adenosine A1 receptor in pig cortical membrane
In DepthDetails ArticlePubMed
TargetAdenosine receptor A1(BOVINE)
Universit£
Curated by ChEMBL
LigandPNGBDBM50224768(2-chloro-N6-cyclopentyl-9H-(2-C-methyl-5-N-benzylc...)
Affinity DataKi:  1.93E+4nM. Assay description: Displacement of [3H]CGS21680 from adenosine A1 receptor in bovine striatum membrane
In DepthDetails ArticlePubMed
TargetAdenosine receptor A1(GUINEA PIG)
Universit£
Curated by ChEMBL
LigandPNGBDBM50224768(2-chloro-N6-cyclopentyl-9H-(2-C-methyl-5-N-benzylc...)
Affinity DataEC50:  5.00E+3nM. Assay description: Agonist activity at adenosine A1 receptor in pig cortical membrane assessed as stimulation of GTPgammaS binding
In DepthDetails ArticlePubMed