BDBM50243439 CHEMBL507532::rac, syn-7,9-difluoro-5-(3-methylcyclohex-2-en-1-yl)-2,2,4-trimethyl 2,5-dihydro-(1H)6-oxa-1-aza-chrysen
SMILES CC1=C(C)[C@H](CCC1)[C@@H]1Oc2c(F)cc(F)cc2-c2ccc3NC(C)(C)C=C(C)c3c12
InChI Key InChIKey=KSNTUZZVDDRCSZ-QYBDOPJKSA-N
Data  2 EC50
  Tab Delimited (TSV)   2D SDfile   Computed 3D by Vconf -m prep SDfile
Find this compound or compounds like it in BindingDB:
Activity Spreadsheet -- Enzyme Inhibition Constant Data from BindingDB
Found 2 hits for monomerid = 50243439
TargetProgesterone receptor(Homo sapiens (Human))
Ligand Pharmaceuticals
Curated by ChEMBL
LigandPNGBDBM50243439(CHEMBL507532 | rac, syn-7,9-difluoro-5-(3-methylcy...)
Affinity DataEC50:  96nM. Assay description: Agonist activity at human progesterone receptor in human T47D cells assessed as alkaline phosphatase activity
In DepthDetails ArticlePubMed
TargetProgesterone receptor(Homo sapiens (Human))
Ligand Pharmaceuticals
Curated by ChEMBL
LigandPNGBDBM50243439(CHEMBL507532 | rac, syn-7,9-difluoro-5-(3-methylcy...)
Affinity DataEC50:  10.7nM. Assay description: Agonist activity at human progesterone receptor
In DepthDetails ArticlePubMed