BDBM50244507 (R)-3-{4-[3-(3-Bromo-5-trifluoromethylphenyl)-1-(4-cyclohex-1-enylphenyl)ureidomethyl]benzoylamino}-2-hydroxypropionic acid::CHEMBL445532
SMILES O[C@H](CNC(=O)c1ccc(CN(C(=O)Nc2cc(Br)cc(c2)C(F)(F)F)c2ccc(cc2)C2=CCCCC2)cc1)C(O)=O
InChI Key InChIKey=OBRBSPYTOYTECA-HHHXNRCGSA-N
Data  2 IC50
  Tab Delimited (TSV)   2D SDfile   Computed 3D by Vconf -m prep SDfile
Find this compound or compounds like it in BindingDB:
Activity Spreadsheet -- Enzyme Inhibition Constant Data from BindingDB
Found 2 hits for monomerid = 50244507
TargetGastric inhibitory polypeptide receptor(Homo sapiens (Human))
Novo Nordisk
Curated by ChEMBL
LigandPNGBDBM50244507((R)-3-{4-[3-(3-Bromo-5-trifluoromethylphenyl)-1-(4...)
Affinity DataIC50:  380nM. Assay description: Binding affinity to human cloned GIPR expressed in BHK cells
In DepthDetails ArticlePubMed
TargetGlucagon receptor(Homo sapiens (Human))
Novo Nordisk
Curated by ChEMBL
LigandPNGBDBM50244507((R)-3-{4-[3-(3-Bromo-5-trifluoromethylphenyl)-1-(4...)
Affinity DataIC50:  7nM. Assay description: Binding affinity to human cloned GluR expressed in BHK cells
In DepthDetails ArticlePubMed