BDBM50245199 (2R)-1-(1-(3-ethoxyphenyl)-2-p-tolyl-1H-imidazole-4-carbonyl)-N-isopropyl-4-(quinolin-3-yl)piperazine-2-carboxamide::CHEMBL449681
SMILES CCOc1cccc(c1)-n1cc(nc1-c1ccc(C)cc1)C(=O)N1CCN(C[C@@H]1C(=O)NC(C)C)c1cnc2ccccc2c1
InChI Key InChIKey=BWNREFLJTMQEQW-MGBGTMOVSA-N
Data  1 IC50  1 EC50
  Tab Delimited (TSV)   2D SDfile   Computed 3D by Vconf -m prep SDfile
Find this compound or compounds like it in BindingDB:
Activity Spreadsheet -- Enzyme Inhibition Constant Data from BindingDB
Found 2 hits for monomerid = 50245199
TargetCholecystokinin receptor type A(Homo sapiens (Human))
Merck
Curated by ChEMBL
LigandPNGBDBM50245199((2R)-1-(1-(3-ethoxyphenyl)-2-p-tolyl-1H-imidazole-...)
Affinity DataEC50:  0.180nM. Assay description: Agonist activity at human CCK1 receptor
In DepthDetails ArticlePubMed
TargetCholecystokinin receptor type A(Homo sapiens (Human))
Merck
Curated by ChEMBL
LigandPNGBDBM50245199((2R)-1-(1-(3-ethoxyphenyl)-2-p-tolyl-1H-imidazole-...)
Affinity DataIC50:  0.210nM. Assay description: Inhibition of human CCK1 receptor
In DepthDetails ArticlePubMed