BDBM50254259 (5S)-5-[(4R)-4-(acetylamino)-3-oxo-3,4,5,10-tetrahydroazepino[3,4-b]indol-2(1H)-yl]-6-oxo-6-[(2-phenylethyl)amino]hexan-1-aminium trifluoroacetate::CHEMBL442605
SMILES CC(=O)N[C@@H]1Cc2c(CN([C@@H](CCCCN)C(=O)NCCc3ccccc3)C1=O)[nH]c1ccccc21
InChI Key InChIKey=BZBKOTKAPXOMFC-RSXGOPAZSA-N
Data  5 IC50
  Tab Delimited (TSV)   2D SDfile   Computed 3D by Vconf -m prep SDfile
Find this compound or compounds like it in BindingDB:
Activity Spreadsheet -- Enzyme Inhibition Constant Data from BindingDB
Found 5 hits for monomerid = 50254259
TargetSomatostatin receptor type 4(Homo sapiens (Human))
Vrije Universiteit Brussel
Curated by ChEMBL
LigandPNGBDBM50254259((5S)-5-[(4R)-4-(acetylamino)-3-oxo-3,4,5,10-tetrah...)
Affinity DataIC50:  7nM. Assay description: Displacement of [125I]-[Leu8, DTrp22, Tyr25]-somatostatin-28 from human recombinant sst4 receptor expressed in chinese hamster CCL39 cells
In DepthDetails ArticlePubMed
TargetSomatostatin receptor type 5(Homo sapiens (Human))
Vrije Universiteit Brussel
Curated by ChEMBL
LigandPNGBDBM50254259((5S)-5-[(4R)-4-(acetylamino)-3-oxo-3,4,5,10-tetrah...)
Affinity DataIC50:  0.560nM. Assay description: Displacement of [125I]-[Leu8, DTrp22, Tyr25]-somatostatin-28 from human recombinant sst5 receptor expressed in chinese hamster CCL39 cells
In DepthDetails ArticlePubMed
TargetSomatostatin receptor type 3(Homo sapiens (Human))
Vrije Universiteit Brussel
Curated by ChEMBL
LigandPNGBDBM50254259((5S)-5-[(4R)-4-(acetylamino)-3-oxo-3,4,5,10-tetrah...)
Affinity DataIC50:  515nM. Assay description: Displacement of [125I]-[Leu8, DTrp22, Tyr25]-somatostatin-28 from human recombinant sst3 receptor expressed in chinese hamster CCL39 cells
In DepthDetails ArticlePubMed
TargetSomatostatin receptor type 2(Homo sapiens (Human))
Vrije Universiteit Brussel
Curated by ChEMBL
LigandPNGBDBM50254259((5S)-5-[(4R)-4-(acetylamino)-3-oxo-3,4,5,10-tetrah...)
Affinity DataIC50: >1.00E+3nM. Assay description: Displacement of [125I]-[Leu8, DTrp22, Tyr25]-somatostatin-28 from human recombinant sst2 receptor expressed in chinese hamster CCL39 cells
In DepthDetails ArticlePubMed
TargetSomatostatin receptor type 1(Homo sapiens (Human))
Vrije Universiteit Brussel
Curated by ChEMBL
LigandPNGBDBM50254259((5S)-5-[(4R)-4-(acetylamino)-3-oxo-3,4,5,10-tetrah...)
Affinity DataIC50:  105nM. Assay description: Displacement of [125I]-[Leu8, DTrp22, Tyr25]-somatostatin-28 from human recombinant sst1 receptor expressed in chinese hamster CCL39 cells
In DepthDetails ArticlePubMed