BDBM50257189 (S)-2-((S)-2-((S)-2-((S)-1-((S)-2-((S)-3,7-diaminoheptanamido)-5-guanidinopentanoyl)pyrrolidine-2-carboxamido)-3-(4-hydroxyphenyl)propanamido)-3,3-dimethylbutanamido)-4-methylpentanoic acid::CHEMBL505906
SMILES [#6]-[#6](-[#6])-[#6]-[#6@H](-[#7]-[#6](=O)-[#6@@H](-[#7]-[#6](=O)-[#6@H](-[#6]-c1ccc(-[#8])cc1)-[#7]-[#6](=O)-[#6@@H]-1-[#6]-[#6]-[#6]-[#7]-1-[#6](=O)-[#6@H](-[#6]-[#6]-[#6]\[#7]=[#6](\[#7])-[#7])-[#7]-[#6](=O)-[#6]-[#6@@H](-[#7])-[#6]-[#6]-[#6]-[#6]-[#7])C([#6])([#6])[#6])-[#6](-[#8])=O
InChI Key InChIKey=CAKYHKUSXYIHGR-CCWZFZQHSA-N
Data  1 KI  1 IC50  1 EC50
  Tab Delimited (TSV)   2D SDfile   Computed 3D by Vconf -m prep SDfile
Find this compound or compounds like it in BindingDB:
Activity Spreadsheet -- Enzyme Inhibition Constant Data from BindingDB
Found 3 hits for monomerid = 50257189
TargetNeurotensin receptor type 1(Homo sapiens (Human))
Medical University Of South Carolina
Curated by ChEMBL
LigandPNGBDBM50257189((S)-2-((S)-2-((S)-2-((S)-1-((S)-2-((S)-3,7-diamino...)
Affinity DataKi:  8.07nM. Assay description: Displacement of [125I]I-Tyr(3)NT from human NTR1
In DepthDetails ArticlePubMed
TargetNeurotensin receptor type 1(Homo sapiens (Human))
Medical University Of South Carolina
Curated by ChEMBL
LigandPNGBDBM50257189((S)-2-((S)-2-((S)-2-((S)-1-((S)-2-((S)-3,7-diamino...)
Affinity DataIC50:  10.8nM. Assay description: Displacement of [125I]I-Tyr(3)NT from human NTR1
In DepthDetails ArticlePubMed
TargetNeurotensin receptor type 1(Homo sapiens (Human))
Medical University Of South Carolina
Curated by ChEMBL
LigandPNGBDBM50257189((S)-2-((S)-2-((S)-2-((S)-1-((S)-2-((S)-3,7-diamino...)
Affinity DataEC50:  6.21nM. Assay description: Agonist activity at NTR1 in human HT-29 cells assessed as increase in intracellular calcium concentration by FLIPR assay
In DepthDetails ArticlePubMed