BDBM50258377 CHEMBL493572::N-(6-methylpyridin-2-yl)-2,3'-bipyridine-5-carboxamide
SMILES Cc1cccc(NC(=O)c2ccc(nc2)-c2cccnc2)n1
InChI Key InChIKey=KPQQVSZUIBYUBT-UHFFFAOYSA-N
Data  1 KI  1 IC50
  Tab Delimited (TSV)   2D SDfile   Computed 3D by Vconf -m prep SDfile
Find this compound or compounds like it in BindingDB:
Activity Spreadsheet -- Enzyme Inhibition Constant Data from BindingDB
Found 2 hits for monomerid = 50258377
TargetMetabotropic glutamate receptor 5(Rattus norvegicus (Rat))
National Institute On Drug Abuse-Intramural Research Program
Curated by ChEMBL
LigandPNGBDBM50258377(CHEMBL493572 | N-(6-methylpyridin-2-yl)-2,3'-bipyr...)
Affinity DataKi:  2.48E+3nM. Assay description: Displacement of [3H]MPEP from rat brain recombinant mGluR5 expressed in HEK293T cells by scintillation counting
In DepthDetails ArticlePubMed
TargetMetabotropic glutamate receptor 5(Rattus norvegicus (Rat))
National Institute On Drug Abuse-Intramural Research Program
Curated by ChEMBL
LigandPNGBDBM50258377(CHEMBL493572 | N-(6-methylpyridin-2-yl)-2,3'-bipyr...)
Affinity DataIC50: >3.00E+3nM. Assay description: Antagonist activity at rat mGluR5 expressed in HEK293A cells assessed as glutamate-induced calcium flux preincubated for 140 sec before glutamate cha...
In DepthDetails ArticlePubMed