BDBM50258618 3,4-Difluoro-N-(6-methylpyridin-2-yl)-benzamide::CHEMBL464550
SMILES Cc1cccc(NC(=O)c2ccc(F)c(F)c2)n1
InChI Key InChIKey=FBBHBWKXALNSTR-UHFFFAOYSA-N
Data  1 KI
  Tab Delimited (TSV)   2D SDfile   Computed 3D by Vconf -m prep SDfile
Find this compound or compounds like it in BindingDB:
Activity Spreadsheet -- Enzyme Inhibition Constant Data from BindingDB
Found 1 hit for monomerid = 50258618
TargetMetabotropic glutamate receptor 5(Homo sapiens (Human))
National Institute On Drug Abuse-Intramural Research Program
Curated by ChEMBL
LigandPNGBDBM50258618(3,4-Difluoro-N-(6-methylpyridin-2-yl)-benzamide | ...)
Affinity DataKi: >1.00E+4nM. Assay description: Displacement of [3H]MPEP from cloned mGluR5 (unknown origin) expressed in HEK293T cells by scintillation counting
In DepthDetails ArticlePubMed