BDBM50264487 2-(3-chlorophenoxy)-N-(2-chlorophenyl)-N-((R)-pyrrolidin-2-ylmethyl)propanamide::CHEMBL489402
SMILES CC(Oc1cccc(Cl)c1)C(=O)N(C[C@H]1CCCN1)c1ccccc1Cl
InChI Key InChIKey=BETBBRQIGQOQCK-BZSJEYESSA-N
Data  1 EC50
  Tab Delimited (TSV)   2D SDfile   Computed 3D by Vconf -m prep SDfile
Find this compound or compounds like it in BindingDB:
Activity Spreadsheet -- Enzyme Inhibition Constant Data from BindingDB
Found 1 hit for monomerid = 50264487
TargetGrowth hormone secretagogue receptor type 1(Homo sapiens (Human))
Bristol-Myers Squibb
Curated by ChEMBL
LigandPNGBDBM50264487(2-(3-chlorophenoxy)-N-(2-chlorophenyl)-N-((R)-pyrr...)
Affinity DataEC50:  780nM. Assay description: Agonist activity at GHSR (unknown origin)
In DepthDetails ArticlePubMed