BDBM50267095 1-Adamantan-1-yl-3-(2-methoxy-phenyl)-urea::CHEMBL445531
SMILES COc1ccccc1NC(=O)NC12CC3CC(CC(C3)C1)C2
InChI Key InChIKey=KVPRHLDYUVRHBP-UHFFFAOYSA-N
Data  1 IC50
  Tab Delimited (TSV)   2D SDfile   Computed 3D by Vconf -m prep SDfile
Find this compound or compounds like it in BindingDB:
Activity Spreadsheet -- Enzyme Inhibition Constant Data from BindingDB
Found 1 hit for monomerid = 50267095
TargetBifunctional epoxide hydrolase 2(Homo sapiens (Human))
Department Of Entomology And University Of California Davis Cancer Center
Curated by ChEMBL
LigandPNGBDBM50267095(1-Adamantan-1-yl-3-(2-methoxy-phenyl)-urea | CHEMB...)
Affinity DataIC50:  8.54E+3nM. Assay description: Inhibition of human soluble epoxide hydrolase by fluorescence assay
In DepthDetails ArticlePubMed