BDBM50268451 2-(ethoxycarbonyl)-1H-indole-5-carboxylic acid::CHEMBL503643
SMILES CCOC(=O)c1cc2cc(ccc2[nH]1)C(O)=O
InChI Key InChIKey=CAVYPAYXEMVXMS-UHFFFAOYSA-N
Data  2 KI  1 EC50
  Tab Delimited (TSV)   2D SDfile   Computed 3D by Vconf -m prep SDfile
Find this compound or compounds like it in BindingDB:
Activity Spreadsheet -- Enzyme Inhibition Constant Data from BindingDB
Found 3 hits for monomerid = 50268451
TargetHistamine H3 receptor(Homo sapiens (Human))
F. Hoffmann-La Roche
Curated by ChEMBL
LigandPNGBDBM50268451(2-(ethoxycarbonyl)-1H-indole-5-carboxylic acid | C...)
Affinity DataKi:  2nM. Assay description: Displacement of [3H](R)-alpha-methylhistamine from human recombinant histamine H3 receptor expressed in CHO cells by liquid scintillation counting
In DepthDetails ArticlePubMed
TargetHistamine H3 receptor(Rattus norvegicus (rat))
F. Hoffmann-La Roche
Curated by ChEMBL
LigandPNGBDBM50268451(2-(ethoxycarbonyl)-1H-indole-5-carboxylic acid | C...)
Affinity DataKi:  7nM. Assay description: Displacement of [3H](R)-alpha-methylhistamine from rat recombinant histamine H3 receptor expressed in CHO cells by liquid scintillation counting
In DepthDetails ArticlePubMed
TargetHistamine H3 receptor(Homo sapiens (Human))
F. Hoffmann-La Roche
Curated by ChEMBL
LigandPNGBDBM50268451(2-(ethoxycarbonyl)-1H-indole-5-carboxylic acid | C...)
Affinity DataEC50:  5nM. Assay description: Inverse agonist activity at human histamine H3 receptor expressed in CHO cells by GTPgamma[35S] binding assay
In DepthDetails ArticlePubMed