BDBM50271254 2-Thio-uridine-5'-pentaphosphate::CHEMBL482683
SMILES O[C@H]1[C@@H](O)[C@@H](O[C@@H]1COP(O)(=O)OP(O)(=O)OP(O)(=O)OP(O)(=O)OP(O)(O)=O)n1ccc(=O)[nH]c1=S
InChI Key InChIKey=HBRMVVAUYWZZGM-XVFCMESISA-N
Data  3 EC50
  Tab Delimited (TSV)   2D SDfile   Computed 3D by Vconf -m prep SDfile
Find this compound or compounds like it in BindingDB:
Activity Spreadsheet -- Enzyme Inhibition Constant Data from BindingDB
Found 3 hits for monomerid = 50271254
TargetP2Y purinoceptor 2(Homo sapiens (Human))
Niddk
Curated by ChEMBL
LigandPNGBDBM50271254(2-Thio-uridine-5'-pentaphosphate | CHEMBL482683)
Affinity DataEC50:  570nM. Assay description: Agonist activity at human P2Y2 receptor expressed in human 1321N1 cells assessed as [3H]inositol phosphate accumulation by scintillation proximity as...
In DepthDetails ArticlePubMed
TargetP2Y purinoceptor 6(Homo sapiens (Human))
Niddk
Curated by ChEMBL
LigandPNGBDBM50271254(2-Thio-uridine-5'-pentaphosphate | CHEMBL482683)
Affinity DataEC50:  7.33E+3nM. Assay description: Agonist activity at human P2Y6 receptor expressed in human 1321N1 cells assessed as [3H]inositol phosphate accumulation by scintillation proximity as...
In DepthDetails ArticlePubMed
TargetP2Y purinoceptor 4(Homo sapiens (Human))
Niddk
Curated by ChEMBL
LigandPNGBDBM50271254(2-Thio-uridine-5'-pentaphosphate | CHEMBL482683)
Affinity DataEC50:  5.27E+3nM. Assay description: Agonist activity at human P2Y4 receptor expressed in human 1321N1 cells assessed as [3H]inositol phosphate accumulation by scintillation proximity as...
In DepthDetails ArticlePubMed