BDBM50271440 CHEMBL505975::Tyr-Pro-Phe-Phe-N(CH3)2
SMILES CN(C)C(=O)[C@H](Cc1ccccc1)NC(=O)[C@H](Cc1ccccc1)NC(=O)[C@@H]1CCCN1C(=O)[C@@H](N)Cc1ccc(O)cc1
InChI Key InChIKey=KRABRQBOUFODOG-KRCBVYEFSA-N
Data  2 KI  2 IC50
  Tab Delimited (TSV)   2D SDfile   Computed 3D by Vconf -m prep SDfile
Find this compound or compounds like it in BindingDB:
Activity Spreadsheet -- Enzyme Inhibition Constant Data from BindingDB
Found 4 hits for monomerid = 50271440
TargetMu-type opioid receptor(Rattus norvegicus (rat))
Lanzhou University
Curated by ChEMBL
LigandPNGBDBM50271440(CHEMBL505975 | Tyr-Pro-Phe-Phe-N(CH3)2)
Affinity DataKi:  273nM. Assay description: Displacement of [3H]DAMGO from mu opioid receptor in rat brain membrane
In DepthDetails ArticlePubMed
TargetDelta-type opioid receptor(Rattus norvegicus (rat))
Lanzhou University
Curated by ChEMBL
LigandPNGBDBM50271440(CHEMBL505975 | Tyr-Pro-Phe-Phe-N(CH3)2)
Affinity DataKi: >1.00E+4nM. Assay description: Displacement of [3H]DPDPE from delta opioid receptor in rat brain membrane
In DepthDetails ArticlePubMed
TargetMu-type opioid receptor(Cavia porcellus)
Lanzhou University
Curated by ChEMBL
LigandPNGBDBM50271440(CHEMBL505975 | Tyr-Pro-Phe-Phe-N(CH3)2)
Affinity DataIC50:  1.81E+3nM. Assay description: Agonist activity at mu opioid receptor in guinea pig ileum assessed as inhibition of electrically-stimulated contraction
In DepthDetails ArticlePubMed
TargetDelta-type opioid receptor(MOUSE)
Lanzhou University
Curated by ChEMBL
LigandPNGBDBM50271440(CHEMBL505975 | Tyr-Pro-Phe-Phe-N(CH3)2)
Affinity DataIC50:  2.72E+3nM. Assay description: Agonist activity at delta opioid receptor in mouse vas deferens assessed as inhibition of electrically-stimulated contraction
In DepthDetails ArticlePubMed