BDBM50274408 CHEMBL484203::N-[4-(4-Methyltriazol-1-yl)butyl]-N-propyl-N-(4-propyn-1-ylcyclohex-3-en-1-yl)amine
SMILES CCCN(CCCCn1cc(C)nn1)C1CCC(=CC1)C#CC
InChI Key InChIKey=CDKQNHRWVCQEIG-UHFFFAOYSA-N
Data  5 KI
  Tab Delimited (TSV)   2D SDfile   Computed 3D by Vconf -m prep SDfile
Find this compound or compounds like it in BindingDB:
Activity Spreadsheet -- Enzyme Inhibition Constant Data from BindingDB
Found 5 hits for monomerid = 50274408
TargetD(4) dopamine receptor(Homo sapiens (Human))
Friedrich-Alexander University
Curated by ChEMBL
LigandPNGBDBM50274408(CHEMBL484203 | N-[4-(4-Methyltriazol-1-yl)butyl]-N...)
Affinity DataKi:  100nM. Assay description: Displacement of [3H]spiperone from human D4 receptor expressed in CHO cells
In DepthDetails ArticlePubMed
TargetD(3) dopamine receptor(Homo sapiens (Human))
Friedrich-Alexander University
Curated by ChEMBL
LigandPNGBDBM50274408(CHEMBL484203 | N-[4-(4-Methyltriazol-1-yl)butyl]-N...)
Affinity DataKi:  280nM. Assay description: Displacement of [3H]spiperone from human D3 receptor expressed in CHO cells
In DepthDetails ArticlePubMed
TargetD(2) dopamine receptor(Homo sapiens (Human))
Friedrich-Alexander University
Curated by ChEMBL
LigandPNGBDBM50274408(CHEMBL484203 | N-[4-(4-Methyltriazol-1-yl)butyl]-N...)
Affinity DataKi:  2.10E+3nM. Assay description: Displacement of [3H]spiperone from human D2short receptor expressed in CHO cells
In DepthDetails ArticlePubMed
TargetD(2) dopamine receptor(Homo sapiens (Human))
Friedrich-Alexander University
Curated by ChEMBL
LigandPNGBDBM50274408(CHEMBL484203 | N-[4-(4-Methyltriazol-1-yl)butyl]-N...)
Affinity DataKi:  4.10E+3nM. Assay description: Displacement of [3H]spiperone from human D2long receptor expressed in CHO cells
In DepthDetails ArticlePubMed
TargetD(1A) dopamine receptor(Sus scrofa)
Friedrich-Alexander University
Curated by ChEMBL
LigandPNGBDBM50274408(CHEMBL484203 | N-[4-(4-Methyltriazol-1-yl)butyl]-N...)
Affinity DataKi: >1.00E+5nM. Assay description: Displacement of [3H]SCH23390 from D1 receptor in pig striatal membrane
In DepthDetails ArticlePubMed