BDBM50281611 1-Pyridin-2-yl-4-[2-(4-thiophen-2-yl-cyclohex-3-enyl)-ethyl]-piperazine::CHEMBL346940::PD-135111
SMILES C(CN1CCN(CC1)c1ccccn1)C1CCC(=CC1)c1cccs1
InChI Key InChIKey=AAFWZBAPCZZXNP-UHFFFAOYSA-N
Data  1 IC50
  Tab Delimited (TSV)   2D SDfile   Computed 3D by Vconf -m prep SDfile
Find this compound or compounds like it in BindingDB:
Activity Spreadsheet -- Enzyme Inhibition Constant Data from BindingDB
Found 1 hit for monomerid = 50281611
TargetD(2) dopamine receptor(Rattus norvegicus (rat))
TBA
Curated by ChEMBL
LigandPNGBDBM50281611(1-Pyridin-2-yl-4-[2-(4-thiophen-2-yl-cyclohex-3-en...)
Affinity DataIC50:  436nM. Assay description: Displacement of [3H]spiperone from rat striatal Dopamine receptor D2
In DepthDetails Article