BDBM50281965 2-Butyl-6-pyridin-2-yl-3-[2'-(2H-tetrazol-5-yl)-biphenyl-4-ylmethyl]-3H-quinazolin-4-one::CHEMBL25313
SMILES CCCCc1nc2ccc(cc2c(=O)n1Cc1ccc(cc1)-c1ccccc1-c1nnn[nH]1)-c1ccccn1
InChI Key InChIKey=VYVSVTRRYTZNOC-UHFFFAOYSA-N
Data  1 IC50
  Tab Delimited (TSV)   2D SDfile   Computed 3D by Vconf -m prep SDfile
Find this compound or compounds like it in BindingDB:
Activity Spreadsheet -- Enzyme Inhibition Constant Data from BindingDB
Found 1 hit for monomerid = 50281965
TargetType-1 angiotensin II receptor(RABBIT)
TBA
Curated by ChEMBL
LigandPNGBDBM50281965(2-Butyl-6-pyridin-2-yl-3-[2'-(2H-tetrazol-5-yl)-bi...)
Affinity DataIC50:  5nM. Assay description: Displacement of [125I]-Sar1-Ile8-AII (without BSA) from type 1 Angiotensin II receptor of rabbit aorta
In DepthDetails Article