BDBM50282293 9-Methyl-2-propoxy-3-[2'-(1H-tetrazol-5-yl)-biphenyl-4-ylmethyl]-pyrido[1,2-a]pyrimidin-4-one::CHEMBL294485
SMILES CCCOc1nc2c(C)cccn2c(=O)c1Cc1ccc(cc1)-c1ccccc1-c1nnn[nH]1
InChI Key InChIKey=HQCQGVLMNNBKLV-UHFFFAOYSA-N
Data  1 IC50
  Tab Delimited (TSV)   2D SDfile   Computed 3D by Vconf -m prep SDfile
Find this compound or compounds like it in BindingDB:
Activity Spreadsheet -- Enzyme Inhibition Constant Data from BindingDB
Found 1 hit for monomerid = 50282293
TargetType-1 angiotensin II receptor(Bos taurus)
TBA
Curated by ChEMBL
LigandPNGBDBM50282293(9-Methyl-2-propoxy-3-[2'-(1H-tetrazol-5-yl)-biphen...)
Affinity DataIC50:  6.00E+3nM. Assay description: Binding affinity for angiotensin II receptor of bovine adrenal cortex
In DepthDetails Article