BDBM50284698 3-[(S)-2-[(S)-2-(3-Benzyl-ureido)-4-methyl-pentanoylamino]-3-(1H-indol-3-yl)-propionylamino]-propionic acid::CHEMBL31051
SMILES CC(C)C[C@H](NC(=O)NCc1ccccc1)C(=O)N[C@H](Cc1c[nH]c2ccccc12)C(=O)NCCC(O)=O
InChI Key InChIKey=HDKNDQYKXXJCQF-BJKOFHAPSA-N
Data  1 IC50
  Tab Delimited (TSV)   2D SDfile   Computed 3D by Vconf -m prep SDfile
Find this compound or compounds like it in BindingDB:
Activity Spreadsheet -- Enzyme Inhibition Constant Data from BindingDB
Found 1 hit for monomerid = 50284698
TargetEndothelin-1 receptor(Sus scrofa)
TBA
Curated by ChEMBL
LigandPNGBDBM50284698(3-[(S)-2-[(S)-2-(3-Benzyl-ureido)-4-methyl-pentano...)
Affinity DataIC50:  3.20E+3nM. Assay description: Binding affinity of the compound was determined against ETA receptor in porcine aortic smooth muscle membrane
In DepthDetails Article