BDBM50286158 CHEMBL103312::Phenyl-carbamic acid (R)-3-(4-benzoyl-piperidin-1-yl)-3-oxo-2-(3-m-tolyl-ureido)-propyl ester
SMILES Cc1cccc(NC(=O)N[C@H](COC(=O)Nc2ccccc2)C(=O)N2CCC(CC2)C(=O)c2ccccc2)c1
InChI Key InChIKey=BYSPJTKARHNTCE-AREMUKBSSA-N
Data  2 IC50
  Tab Delimited (TSV)   2D SDfile   Computed 3D by Vconf -m prep SDfile
Find this compound or compounds like it in BindingDB:
Activity Spreadsheet -- Enzyme Inhibition Constant Data from BindingDB
Found 2 hits for monomerid = 50286158
TargetGastrin/cholecystokinin type B receptor(Homo sapiens (Human))
TBA
Curated by ChEMBL
LigandPNGBDBM50286158(CHEMBL103312 | Phenyl-carbamic acid (R)-3-(4-benzo...)
Affinity DataIC50:  120nM. Assay description: Inhibitory activity towards binding of [125I]-Bolton-Hunter-CCK-8 to CCKB receptor in guinea pig cortical tissue
In DepthDetails Article
TargetCholecystokinin receptor type A(Cavia porcellus)
TBA
Curated by ChEMBL
LigandPNGBDBM50286158(CHEMBL103312 | Phenyl-carbamic acid (R)-3-(4-benzo...)
Affinity DataIC50:  290nM. Assay description: Inhibitory activity towards binding of [125I]-Bolton-Hunter-CCK-8 to CCKA receptor in guinea pig pancreatic tissue
In DepthDetails Article