BDBM50286864 (S)-2-{(S)-2-[(S)-2-({(R)-1-[5-Guanidino-2-(3-guanidino-propyl)-pentanoyl]-pyrrolidine-2-carbonyl}-amino)-3-(1H-indol-3-yl)-propionylamino]-3,3-dimethyl-butyrylamino}-4-methyl-pentanoic acid::CHEMBL6716
SMILES CC(C)C[C@H](NC(=O)[C@@H](NC(=O)[C@H](Cc1c[nH]c2ccccc12)NC(=O)[C@H]1CCCN1C(=O)C(CCCNC(N)=N)CCCNC(N)=N)C(C)(C)C)C(O)=O
InChI Key InChIKey=KSAMAHDHHCBDRP-VZNYXHRGSA-N
Data  1 KI
  Tab Delimited (TSV)   2D SDfile   Computed 3D by Vconf -m prep SDfile
Find this compound or compounds like it in BindingDB:
Activity Spreadsheet -- Enzyme Inhibition Constant Data from BindingDB
Found 1 hit for monomerid = 50286864
TargetNeurotensin receptor type 1(MOUSE)
TBA
Curated by ChEMBL
LigandPNGBDBM50286864((S)-2-{(S)-2-[(S)-2-({(R)-1-[5-Guanidino-2-(3-guan...)
Affinity DataKi:  0.100nM. Assay description: Binding affinity for Neurotensin Receptor
In DepthDetails Article