BDBM50289605 4-Furan-2-yl-6-furan-3-yl-2-(4-methyl-piperazin-1-yl)-pyrimidine::CHEMBL42061
SMILES CN1CCN(CC1)c1nc(cc(n1)-c1ccco1)-c1ccoc1
InChI Key InChIKey=AKMGJJTVIPHEOZ-UHFFFAOYSA-N
Data  2 KI
  Tab Delimited (TSV)   2D SDfile   Computed 3D by Vconf -m prep SDfile
Find this compound or compounds like it in BindingDB:
Activity Spreadsheet -- Enzyme Inhibition Constant Data from BindingDB
Found 2 hits for monomerid = 50289605
Target5-hydroxytryptamine receptor 2A(Rattus norvegicus (rat))
TBA
Curated by ChEMBL
LigandPNGBDBM50289605(4-Furan-2-yl-6-furan-3-yl-2-(4-methyl-piperazin-1-...)
Affinity DataKi:  13nM. Assay description: Displacement of [3H]-ketanserin from 5-hydroxytryptamine 2A receptor of rat brain cortex
In DepthDetails Article
Target5-hydroxytryptamine receptor 1A(Rattus norvegicus (rat))
TBA
Curated by ChEMBL
LigandPNGBDBM50289605(4-Furan-2-yl-6-furan-3-yl-2-(4-methyl-piperazin-1-...)
Affinity DataKi:  415nM. Assay description: Displacement of [3H]-8-OH-DPAT binding to 5-hydroxytryptamine 1A receptor of rat brain hippocampus
In DepthDetails Article